Author Topic: B2M3 NODE IN SUBSTANCE DESIGNER WONT EXPORT SBSAR  (Read 219 times)

B2M3 NODE IN SUBSTANCE DESIGNER WONT EXPORT SBSAR
INSERTED B2M3.1 SBSAR FROM MY COMMERCIAL B2M3 I PURCHESED ON STEAM TO A GRAPH IN SUBSTANCE DESIGNER
6 I ALSO PURCHESED ON STEAM AND WHEN I TRY TO  EXPORT A SBSAR I GET THIS ERROR MASSAGE
launch application:
   C:/SteamLibrary/steamapps/common/Substance Designer 6/sbscooker.exe --inputs F:/pbr d5300/New_Graph/121212.sbs --includes C:/SteamLibrary/steamapps/common/Substance Designer 6/resources/packages --output-path C:/Users/User/AppData/Local/Temp/Allegorithmic/Substance Designer --output-name 121212 --expose-output-size 0 --expose-random-seed 1 --expose-pixel-size 1 --size-limit 12 --compression-mode 0
Execution failed ! (Exit Code: 13)


Output:
[WARNING][SBSCooker]Can't find subgraph input:
   Input identifier: height_optional
   Subgraph Url: pkg:///Bitmap2Material_3?dependency=1310926521
   From Graph: pkg:///New_Graph?dependency=1310926983
   ... (repeated 1 more times)
[WARNING][SBSCooker]Can't find subgraph input:
   Input identifier: gunge_optional
   Subgraph Url: pkg:///Bitmap2Material_3?dependency=1310926521
   From Graph: pkg:///New_Graph?dependency=1310926983
[WARNING][SBSCooker]Can't find subgraph input:
   Input identifier: metallic_optional
   Subgraph Url: pkg:///Bitmap2Material_3?dependency=1310926521
   From Graph: pkg:///New_Graph?dependency=1310926983
   ... (repeated 1 more times)
[WARNING][SBSCooker]Can't find subgraph input:
   Input identifier: normal_optional
   Subgraph Url: pkg:///Bitmap2Material_3?dependency=1310926521
   From Graph: pkg:///New_Graph?dependency=1310926983
   ... (repeated 1 more times)
[WARNING][SBSCooker]Can't find subgraph input:
   Input identifier: emissive_optional
   Subgraph Url: pkg:///Bitmap2Material_3?dependency=1310926521
   From Graph: pkg:///New_Graph?dependency=1310926983
   ... (repeated 1 more times)
[ERROR][SBSCooker]Variable type mismatch:
      Variable Name: input_scale
      Of Type: Float2
      Accessed By: Get Float
      While Evaluating Parameter: matrix22
      In Graph: pkg:///Bitmap2Material_3?dependency=1310926521
      Node ID: 3203334144
[ERROR][SBSCooker]Cooking fail [Error 13]

WHEN I  TRY AND USE ONLY THE B2M 3 NODE ON EXPORT I GET THIS ERROR launch application:
   C:/SteamLibrary/steamapps/common/Substance Designer 6/sbscooker.exe --inputs F:/pbr d5300/TEST.sbs --includes C:/SteamLibrary/steamapps/common/Substance Designer 6/resources/packages --output-path C:/Users/User/AppData/Local/Temp/Allegorithmic/Substance Designer --output-name TEST --expose-output-size 0 --expose-random-seed 1 --expose-pixel-size 1 --size-limit 12 --enable-icons --compression-mode 2
Execution failed ! (Exit Code: 13)


Output:
[ERROR][SBSCooker]Variable type mismatch:
      Variable Name: input_scale
      Of Type: Float2
      Accessed By: Get Float
      While Evaluating Parameter: matrix22
      In Graph: pkg:///Bitmap2Material_3?dependency=1310991147
      Node ID: 3203334144
[ERROR][SBSCooker]Cooking fail [Error 13]